BDBM50291226 CHEMBL151829::[(S)-1-((S)-1-Cyclohexylmethyl-2-oxo-ethylcarbamoyl)-3-methyl-butyl]-carbamic acid benzyl ester
SMILES CC(C)C[C@H](NC(=O)OCc1ccccc1)C(=O)N[C@@H](CC1CCCCC1)C=O
InChI Key InChIKey=WJDUVOGIVYWHMG-SFTDATJTSA-N
Data  1 IC50
  Tab Delimited (TSV)   2D SDfile   Computed 3D by Vconf -m prep SDfile
Find this compound or compounds like it in BindingDB:
Activity Spreadsheet -- Enzyme Inhibition Constant Data from BindingDB
Found 1 hit for monomerid = 50291226
TargetCalpain-1 catalytic subunit(Homo sapiens (Human))
TBA
Curated by ChEMBL
LigandPNGBDBM50291226(CHEMBL151829 | [(S)-1-((S)-1-Cyclohexylmethyl-2-ox...)
Affinity DataIC50:  11nM. Assay description: Inhibitory activity evaluated against recombinant human calpain 1
In DepthDetails Article