BDBM50291406 CHEMBL4165737
SMILES Cc1nn(c(Oc2ccc(cc2)-c2nc3cc(ccc3[nH]2)C(O)=O)c1\C=N\NC(N)=O)-c1ccccc1
InChI Key InChIKey=KYEZBPMGAHYKHV-CCVNUDIWSA-N
Data  1 IC50
  Tab Delimited (TSV)   2D SDfile   Computed 3D by Vconf -m prep SDfile
Find this compound or compounds like it in BindingDB:
Activity Spreadsheet -- Enzyme Inhibition Constant Data from BindingDB
Found 1 hit for monomerid = 50291406
TargetSerine/threonine-protein kinase Chk2(Homo sapiens (Human))
National Research Centre
Curated by ChEMBL
LigandPNGBDBM50291406(CHEMBL4165737)
Affinity DataIC50:  26nM. Assay description: Inhibition of Chk2 (unknown origin) by spectrophotometric analysis
In DepthDetails ArticlePubMed