BDBM50292325 CHEMBL240109::N-cyclohexyl-2-(2,4-dichlorobenzyl)-3-(4-chloro-3-methylphenyl)-1,1-dioxo-1,2-dihydro-1lambda6-1,2,6-thiadiazine-5-carboxamide
SMILES Cc1cc(ccc1Cl)C1=CC(=NS(=O)(=O)N1Cc1ccc(Cl)cc1Cl)C(=O)NC1CCCCC1
InChI Key InChIKey=IBLIIACINADNOK-UHFFFAOYSA-N
Data  1 EC50
  Tab Delimited (TSV)   2D SDfile   Computed 3D by Vconf -m prep SDfile
Find this compound or compounds like it in BindingDB:
Activity Spreadsheet -- Enzyme Inhibition Constant Data from BindingDB
Found 1 hit for monomerid = 50292325
TargetCannabinoid receptor 1(Mus musculus (Mouse))
Instituto De QuíMica MéDica
Curated by ChEMBL
LigandPNGBDBM50292325(CHEMBL240109 | N-cyclohexyl-2-(2,4-dichlorobenzyl)...)
Affinity DataEC50:  3.69E+4nM. Assay description: Agonist activity at CB1 receptor in ICR mouse vas deferens assessed as inhibition of electrically-stimulated contraction
In DepthDetails ArticlePubMed