BDBM50292911 (+/-)-trans-2-Hydroxy-3-(4-(4-aminobenzoyl)piperidino)tetralin::CHEMBL473548
SMILES Nc1ccc(cc1)C(=O)C1CCN(CC1)[C@@H]1Cc2ccccc2C[C@H]1O
InChI Key InChIKey=YCMBHNGPEVEVOO-NHCUHLMSSA-N
Data  2 KI
  Tab Delimited (TSV)   2D SDfile   Computed 3D by Vconf -m prep SDfile
Find this compound or compounds like it in BindingDB:
Activity Spreadsheet -- Enzyme Inhibition Constant Data from BindingDB
Found 2 hits for monomerid = 50292911
TargetVesicular acetylcholine transporter(Homo sapiens (Human))
Washington University
Curated by ChEMBL
LigandPNGBDBM50292911((+/-)-trans-2-Hydroxy-3-(4-(4-aminobenzoyl)piperid...)
Affinity DataKi:  1.70nM. Assay description: Displacement of [3H]vesamicol from human vesicular acetylcholine transporter expressed in rat PC12 cells by liquid scintillation spectrometry
In DepthDetails ArticlePubMed
TargetVesicular acetylcholine transporter(Homo sapiens (Human))
Washington University
Curated by ChEMBL
LigandPNGBDBM50292911((+/-)-trans-2-Hydroxy-3-(4-(4-aminobenzoyl)piperid...)
Affinity DataKi:  1.70nM. Assay description: Displacement of (-)-[3H]vesamicol from human VAChT expressed in rat PC12 cell membrane after 20 hrs
In DepthDetails ArticlePubMed