BDBM50293453 4-((1-(benzo[d][1,3]dioxol-5-ylmethyl)piperidin-4-yl)methyl)-N-benzylbenzamide::CHEMBL565119
SMILES O=C(NCc1ccccc1)c1ccc(CC2CCN(Cc3ccc4OCOc4c3)CC2)cc1
InChI Key InChIKey=MLASXHHBHIILFK-UHFFFAOYSA-N
Data  1 KI
  Tab Delimited (TSV)   2D SDfile   Computed 3D by Vconf -m prep SDfile
Find this compound or compounds like it in BindingDB:
Activity Spreadsheet -- Enzyme Inhibition Constant Data from BindingDB
Found 1 hit for monomerid = 50293453
TargetMelanin-concentrating hormone receptor 1(Homo sapiens (Human))
University Of Jordan
Curated by ChEMBL
LigandPNGBDBM50293453(4-((1-(benzo[d][1,3]dioxol-5-ylmethyl)piperidin-4-...)
Affinity DataKi:  5.64E+3nM. Assay description: Binding affinity to MCH1 receptor
In DepthDetails ArticlePubMed