BDBM50293469 4-((4-(benzo[d][1,3]dioxol-5-ylmethyl)-2-methylpiperazin-1-yl)methyl)-N-((S)-1-(4-bromophenyl)ethyl)benzamide::CHEMBL560888
SMILES C[C@H](NC(=O)c1ccc(CN2CCN(Cc3ccc4OCOc4c3)CC2C)cc1)c1ccc(Br)cc1
InChI Key InChIKey=KYIFZXJUWBRQGE-LBAQZLPGSA-N
Data  1 KI
  Tab Delimited (TSV)   2D SDfile   Computed 3D by Vconf -m prep SDfile
Find this compound or compounds like it in BindingDB:
Activity Spreadsheet -- Enzyme Inhibition Constant Data from BindingDB
Found 1 hit for monomerid = 50293469
TargetMelanin-concentrating hormone receptor 1(Homo sapiens (Human))
University Of Jordan
Curated by ChEMBL
LigandPNGBDBM50293469(4-((4-(benzo[d][1,3]dioxol-5-ylmethyl)-2-methylpip...)
Affinity DataKi:  4.56E+3nM. Assay description: Binding affinity to MCH1 receptor
In DepthDetails ArticlePubMed