BDBM50293479 (R)-N-(1-(4-iodophenyl)propyl)-4-((1-(quinolin-7-ylmethyl)piperidin-4-yl)methyl)benzamide::CHEMBL549395
SMILES CC[C@@H](NC(=O)c1ccc(CC2CCN(Cc3ccc4cccnc4c3)CC2)cc1)c1ccc(I)cc1
InChI Key InChIKey=HQUMOKNPGGGINC-SSEXGKCCSA-N
Data  1 KI
  Tab Delimited (TSV)   2D SDfile   Computed 3D by Vconf -m prep SDfile
Find this compound or compounds like it in BindingDB:
Activity Spreadsheet -- Enzyme Inhibition Constant Data from BindingDB
Found 1 hit for monomerid = 50293479
TargetMelanin-concentrating hormone receptor 1(Homo sapiens (Human))
University Of Jordan
Curated by ChEMBL
LigandPNGBDBM50293479((R)-N-(1-(4-iodophenyl)propyl)-4-((1-(quinolin-7-y...)
Affinity DataKi:  5nM. Assay description: Binding affinity to MCH1 receptor
In DepthDetails ArticlePubMed