BDBM50293868 8-(3,5-dichloro-pyridin-4-ylmethoxy)-2-methyl-4-(2-methyl-2H-pyrazol-3-yl)-quinoline::CHEMBL562434
SMILES Cc1cc(-c2ccnn2C)c2cccc(OCc3c(Cl)cncc3Cl)c2n1
InChI Key InChIKey=KZUVKKKAWIAJFL-UHFFFAOYSA-N
Data  2 IC50
  Tab Delimited (TSV)   2D SDfile   Computed 3D by Vconf -m prep SDfile
Find this compound or compounds like it in BindingDB:
Activity Spreadsheet -- Enzyme Inhibition Constant Data from BindingDB
Found 2 hits for monomerid = 50293868
TargetB2 bradykinin receptor(Homo sapiens (Human))
Jerini
Curated by ChEMBL
LigandPNGBDBM50293868(8-(3,5-dichloro-pyridin-4-ylmethoxy)-2-methyl-4-(2...)
Affinity DataIC50:  50nM. Assay description: Displacement of [3H]bradykinin from human recombinant B2 receptor expressed in HEK293 cells
In DepthDetails ArticlePubMed
TargetB2 bradykinin receptor(Homo sapiens (Human))
Jerini
Curated by ChEMBL
LigandPNGBDBM50293868(8-(3,5-dichloro-pyridin-4-ylmethoxy)-2-methyl-4-(2...)
Affinity DataIC50:  180nM. Assay description: Antagonist activity at B2 receptor in human HF15 cells assessed as inhibition of bradykinin-induced calcium mobilization
In DepthDetails ArticlePubMed