BDBM50293884 8-[3-chloro-5-(thiazol-2-ylsulfanyl)-pyridin-4-ylmethoxy]-2-methyl-4-(2-methyl-2Hpyrazol-3-yl)-quinoline::CHEMBL551758
SMILES Cc1cc(-c2ccnn2C)c2cccc(OCc3c(Cl)cncc3Sc3nccs3)c2n1
InChI Key InChIKey=TUCLMUPXHWRYJT-UHFFFAOYSA-N
Data  3 IC50
  Tab Delimited (TSV)   2D SDfile   Computed 3D by Vconf -m prep SDfile
Find this compound or compounds like it in BindingDB:
Activity Spreadsheet -- Enzyme Inhibition Constant Data from BindingDB
Found 3 hits for monomerid = 50293884
TargetB2 bradykinin receptor(Homo sapiens (Human))
Jerini
Curated by ChEMBL
LigandPNGBDBM50293884(8-[3-chloro-5-(thiazol-2-ylsulfanyl)-pyridin-4-ylm...)
Affinity DataIC50:  29nM. Assay description: Antagonist activity at B2 receptor in human HF15 cells assessed as inhibition of bradykinin-induced calcium mobilization
In DepthDetails ArticlePubMed
TargetB2 bradykinin receptor(Homo sapiens (Human))
Jerini
Curated by ChEMBL
LigandPNGBDBM50293884(8-[3-chloro-5-(thiazol-2-ylsulfanyl)-pyridin-4-ylm...)
Affinity DataIC50:  50nM. Assay description: Displacement of [3H]bradykinin from human recombinant B2 receptor expressed in HEK293 cells
In DepthDetails ArticlePubMed
TargetB2 bradykinin receptor(Homo sapiens (Human))
Jerini
Curated by ChEMBL
LigandPNGBDBM50293884(8-[3-chloro-5-(thiazol-2-ylsulfanyl)-pyridin-4-ylm...)
Affinity DataIC50:  470nM. Assay description: Displacement of [3H]bradykinin from wild-type B2 receptor
In DepthDetails ArticlePubMed