BDBM50293969 (R)-5-Chloro-3-(2-chloro-6-methylphenylamino)-1-(1-cyclopropylpropyl)pyrazin-2(1H)-one::CHEMBL560896
SMILES CC[C@H](C1CC1)n1cc(Cl)nc(Nc2c(C)cccc2Cl)c1=O
InChI Key InChIKey=SVZHRHXYKGKQRK-CYBMUJFWSA-N
Data  1 IC50
  Tab Delimited (TSV)   2D SDfile   Computed 3D by Vconf -m prep SDfile
Find this compound or compounds like it in BindingDB:
Activity Spreadsheet -- Enzyme Inhibition Constant Data from BindingDB
Found 1 hit for monomerid = 50293969
TargetCorticotropin-releasing factor receptor 1(Rattus norvegicus (rat))
Bristol-Myers Squibb
Curated by ChEMBL
LigandPNGBDBM50293969((R)-5-Chloro-3-(2-chloro-6-methylphenylamino)-1-(1...)
Affinity DataIC50:  9.30nM. Assay description: Displacement of [125I]Tyr-ovine-CRF from CRF1 receptor in rat frontal cortex homogenate by gamma counting
In DepthDetails ArticlePubMed