BDBM50293975 (R)-5-Chloro-1-(1-cyclopropyl-2-methoxyethyl)-3-(4-ethoxy-2,5-dimethylphenylamino)pyrazin-2(1H)-one::CHEMBL561097
SMILES CCOc1cc(C)c(Nc2nc(Cl)cn([C@@H](COC)C3CC3)c2=O)cc1C
InChI Key InChIKey=MMZVSBHXIIOUOF-INIZCTEOSA-N
Data  1 IC50
  Tab Delimited (TSV)   2D SDfile   Computed 3D by Vconf -m prep SDfile
Find this compound or compounds like it in BindingDB:
Activity Spreadsheet -- Enzyme Inhibition Constant Data from BindingDB
Found 1 hit for monomerid = 50293975
TargetCorticotropin-releasing factor receptor 1(Rattus norvegicus (rat))
Bristol-Myers Squibb
Curated by ChEMBL
LigandPNGBDBM50293975((R)-5-Chloro-1-(1-cyclopropyl-2-methoxyethyl)-3-(4...)
Affinity DataIC50:  1.5nM. Assay description: Displacement of [125I]Tyr-ovine-CRF from CRF1 receptor in rat frontal cortex homogenate by gamma counting
In DepthDetails ArticlePubMed