BDBM50293983 (R)-3-[5-Bromo-7-methoxy-2H-benzo[b][1,4]oxazin-4(3H)-yl]-5-chloro-1-(1-cyclopropylethyl)pyrazin-2(1H)-one::CHEMBL550140
SMILES COc1cc(Br)c2N(CCOc2c1)c1nc(Cl)cn([C@H](C)C2CC2)c1=O
InChI Key InChIKey=PDBXRZXKMFTCOH-SNVBAGLBSA-N
Data  1 IC50
  Tab Delimited (TSV)   2D SDfile   Computed 3D by Vconf -m prep SDfile
Find this compound or compounds like it in BindingDB:
Activity Spreadsheet -- Enzyme Inhibition Constant Data from BindingDB
Found 1 hit for monomerid = 50293983
TargetCorticotropin-releasing factor receptor 1(Rattus norvegicus (rat))
Bristol-Myers Squibb
Curated by ChEMBL
LigandPNGBDBM50293983((R)-3-[5-Bromo-7-methoxy-2H-benzo[b][1,4]oxazin-4(...)
Affinity DataIC50:  19nM. Assay description: Displacement of [125I]Tyr-ovine-CRF from CRF1 receptor in rat frontal cortex homogenate by gamma counting
In DepthDetails ArticlePubMed