BDBM50294676 7-(2-fluorophenyl)-N,1-dimethyl-1,6-dihydroimidazo[4,5-d]pyrrolo[2,3-b]pyridin-4-amine::CHEMBL556806
SMILES CNc1nc2[nH]c(cc2c2n(C)cnc12)-c1ccccc1F
InChI Key InChIKey=CLRVYWUBJBJDOI-UHFFFAOYSA-N
Data  2 IC50
  Tab Delimited (TSV)   2D SDfile   Computed 3D by Vconf -m prep SDfile
Find this compound or compounds like it in BindingDB:
Activity Spreadsheet -- Enzyme Inhibition Constant Data from BindingDB
Found 2 hits for monomerid = 50294676
TargetInhibitor of nuclear factor kappa-B kinase subunit beta(Homo sapiens (Human))
China Pharmaceutical University
Curated by ChEMBL
LigandPNGBDBM50294676(7-(2-fluorophenyl)-N,1-dimethyl-1,6-dihydroimidazo...)
Affinity DataIC50:  44nM. Assay description: Inhibition of human IKKbeta using GST-IkappaBalpha as substrate
In DepthDetails ArticlePubMed
TargetInhibitor of nuclear factor kappa-B kinase subunit alpha(Homo sapiens (Human))
Bristol-Myers Squibb Research And Development
Curated by ChEMBL
LigandPNGBDBM50294676(7-(2-fluorophenyl)-N,1-dimethyl-1,6-dihydroimidazo...)
Affinity DataIC50:  44nM. Assay description: Inhibition of IKK1-catalyzed phosphorylation of GST-tagged IkappaBalpha fusion protein by fluorescence polarization assay
In DepthDetails ArticlePubMed