BDBM50295030 5-(4-Cyclopropylphenyl)-1-(2,4-difluorophenyl)-4-methyl-N-piperidin-1-yl-1H-pyrazole-3-carboxamide::CHEMBL551966
SMILES Cc1c(nn(c1-c1ccc(cc1)C1CC1)-c1ccc(F)cc1F)C(=O)NN1CCCCC1
InChI Key InChIKey=SDHNLNXASWUTHB-UHFFFAOYSA-N
Data  1 KI
  Tab Delimited (TSV)   2D SDfile   Computed 3D by Vconf -m prep SDfile
Find this compound or compounds like it in BindingDB:
Activity Spreadsheet -- Enzyme Inhibition Constant Data from BindingDB
Found 1 hit for monomerid = 50295030
TargetCannabinoid receptor 1(Rattus norvegicus (rat))
Gedeon Richter
Curated by ChEMBL
LigandPNGBDBM50295030(5-(4-Cyclopropylphenyl)-1-(2,4-difluorophenyl)-4-m...)
Affinity DataKi:  34nM. Assay description: Displacement of [3H]SR141716A from CB1 receptor in rat cerebellum by scintillation spectrometry
In DepthDetails ArticlePubMed