BDBM50295039 5-(4-Cyclopropylphenyl)-1-(2,4-dichlorophenyl)-4-ethyl-N-piperidin-1-yl-1-H-pyrazole-3-carboxamide::CHEMBL550982
SMILES CCc1c(nn(c1-c1ccc(cc1)C1CC1)-c1ccc(Cl)cc1Cl)C(=O)NN1CCCCC1
InChI Key InChIKey=RKROYLFBZQHAOQ-UHFFFAOYSA-N
Data  1 KI
  Tab Delimited (TSV)   2D SDfile   Computed 3D by Vconf -m prep SDfile
Find this compound or compounds like it in BindingDB:
Activity Spreadsheet -- Enzyme Inhibition Constant Data from BindingDB
Found 1 hit for monomerid = 50295039
TargetCannabinoid receptor 1(Rattus norvegicus (rat))
Gedeon Richter
Curated by ChEMBL
LigandPNGBDBM50295039(5-(4-Cyclopropylphenyl)-1-(2,4-dichlorophenyl)-4-e...)
Affinity DataKi:  4nM. Assay description: Displacement of [3H]SR141716A from CB1 receptor in rat cerebellum by scintillation spectrometry
In DepthDetails ArticlePubMed