BDBM50295065 (2S)-2-{[4-(6-Fluoroquinolin-2-yl)piperazin-1-yl]methyl}-8-methyl-2,3-dihydro[1,4]dioxino[2,3-f]quinoline::CHEMBL550169
SMILES Cc1ccc2c3O[C@@H](CN4CCN(CC4)c4ccc5cc(F)ccc5n4)COc3ccc2n1
InChI Key InChIKey=NRGWSNZJBSMIMP-FQEVSTJZSA-N
Data  2 KI  1 IC50
  Tab Delimited (TSV)   2D SDfile   Computed 3D by Vconf -m prep SDfile
Find this compound or compounds like it in BindingDB:
Activity Spreadsheet -- Enzyme Inhibition Constant Data from BindingDB
Found 3 hits for monomerid = 50295065
Target5-hydroxytryptamine receptor 1A(Homo sapiens (Human))
Wyeth Research
Curated by ChEMBL
LigandPNGBDBM50295065((2S)-2-{[4-(6-Fluoroquinolin-2-yl)piperazin-1-yl]m...)
Affinity DataKi:  32.9nM. Assay description: Displacement of [3H]8-OH-DPAT from human 5HT1A receptor expressed in CHO cells
In DepthDetails ArticlePubMed
TargetSodium-dependent serotonin transporter(Rattus norvegicus (rat))
Wyeth Research
Curated by ChEMBL
LigandPNGBDBM50295065((2S)-2-{[4-(6-Fluoroquinolin-2-yl)piperazin-1-yl]m...)
Affinity DataKi:  66nM. Assay description: Displacement of [3H]paroxetine from 5HT transporter in rat cortical membrane
In DepthDetails ArticlePubMed
Target5-hydroxytryptamine receptor 1A(Homo sapiens (Human))
Wyeth Research
Curated by ChEMBL
LigandPNGBDBM50295065((2S)-2-{[4-(6-Fluoroquinolin-2-yl)piperazin-1-yl]m...)
Affinity DataIC50:  2.17E+3nM. Assay description: Antagonist activity at human 5HT1A receptor expressed in CHO cells assessed as stimulation of [35S]GTPgammaS binding
In DepthDetails ArticlePubMed