BDBM50295281 2-(2-(2-fluorophenoxy)phenyl)acetic acid::CHEMBL29804::[2-(2-Fluoro-phenoxy)-phenyl]-acetic acid
SMILES OC(=O)Cc1ccccc1Oc1ccccc1F
InChI Key InChIKey=LAVKHAMQQVBXLL-UHFFFAOYSA-N
Data  1 IC50
  Tab Delimited (TSV)   2D SDfile   Computed 3D by Vconf -m prep SDfile
Find this compound or compounds like it in BindingDB:
Activity Spreadsheet -- Enzyme Inhibition Constant Data from BindingDB
Found 1 hit for monomerid = 50295281
TargetInterleukin-8(Homo sapiens (Human))
Grupo Uriach
Curated by ChEMBL
LigandPNGBDBM50295281(2-(2-(2-fluorophenoxy)phenyl)acetic acid | CHEMBL2...)
Affinity DataIC50:  13nM. Assay description: Inhibition of CXCL8-induced chemotaxis in human polymorphonuclear leukocyte pretreated for 15 mins measured after 4 hrs by cell migration assay
In DepthDetails ArticlePubMed