BDBM50295407 3-[3-[N-(2,4-Dimethylbenzyl)-N-methylamino]propyl]benzo[d]-oxazol-2(3H)-one::CHEMBL570315
SMILES CN(CCCn1c2ccccc2oc1=O)Cc1ccc(C)cc1C
InChI Key InChIKey=OZGFIYXCQMJEGG-UHFFFAOYSA-N
Data  1 KI
  Tab Delimited (TSV)   2D SDfile   Computed 3D by Vconf -m prep SDfile
Find this compound or compounds like it in BindingDB:
Activity Spreadsheet -- Enzyme Inhibition Constant Data from BindingDB
Found 1 hit for monomerid = 50295407
TargetSigma non-opioid intracellular receptor 1(RAT)
University Of Trieste
Curated by ChEMBL
LigandPNGBDBM50295407(3-[3-[N-(2,4-Dimethylbenzyl)-N-methylamino]propyl]...)
Affinity DataKi:  1.83E+3nM. Assay description: Displacement of [3H](+)-pentazocine from sigma1 receptor in rat liver membrane by liquid scintillation counting
In DepthDetails ArticlePubMed