BDBM50295417 3-[4-[N-(2,4-Dimethylbenzyl)-N-methylamino]butyl]benzo[d]oxazol-2(3H)-one::CHEMBL563001
SMILES CN(CCCCn1c2ccccc2oc1=O)Cc1ccc(C)cc1C
InChI Key InChIKey=ZPGCVPHXEZTDIN-UHFFFAOYSA-N
Data  1 KI
  Tab Delimited (TSV)   2D SDfile   Computed 3D by Vconf -m prep SDfile
Find this compound or compounds like it in BindingDB:
Activity Spreadsheet -- Enzyme Inhibition Constant Data from BindingDB
Found 1 hit for monomerid = 50295417
TargetSigma non-opioid intracellular receptor 1(RAT)
University Of Trieste
Curated by ChEMBL
LigandPNGBDBM50295417(3-[4-[N-(2,4-Dimethylbenzyl)-N-methylamino]butyl]b...)
Affinity DataKi:  239nM. Assay description: Displacement of [3H](+)-pentazocine from sigma1 receptor in rat liver membrane by liquid scintillation counting
In DepthDetails ArticlePubMed