BDBM50295419 CHEMBL559782::N-Phenyl-1-(4-chlorobenzyl)piperidine-4-carboxamide
SMILES Clc1ccc(CN2CCC(CC2)C(=O)Nc2ccccc2)cc1
InChI Key InChIKey=GNOLHPXYPDZETK-UHFFFAOYSA-N
Data  1 KI
  Tab Delimited (TSV)   2D SDfile   Computed 3D by Vconf -m prep SDfile
Find this compound or compounds like it in BindingDB:
Activity Spreadsheet -- Enzyme Inhibition Constant Data from BindingDB
Found 1 hit for monomerid = 50295419
TargetSigma non-opioid intracellular receptor 1(RAT)
University Of Trieste
Curated by ChEMBL
LigandPNGBDBM50295419(CHEMBL559782 | N-Phenyl-1-(4-chlorobenzyl)piperidi...)
Affinity DataKi:  45nM. Assay description: Displacement of [3H](+)-pentazocine from sigma1 receptor in rat liver membrane by liquid scintillation counting
In DepthDetails ArticlePubMed