BDBM50295630 CHEMBL557232::rac-4'-(1-Imidazol-1-yl-propyl)-3,5-dimethyl-biphenyl-4-ol
SMILES CCC(c1ccc(cc1)-c1cc(C)c(O)c(C)c1)n1ccnc1
InChI Key InChIKey=DBNZDJDCWSGGOH-UHFFFAOYSA-N
Data  1 IC50
  Tab Delimited (TSV)   2D SDfile   Computed 3D by Vconf -m prep SDfile
Find this compound or compounds like it in BindingDB:
Activity Spreadsheet -- Enzyme Inhibition Constant Data from BindingDB
Found 1 hit for monomerid = 50295630
TargetSteroid 17-alpha-hydroxylase/17,20 lyase(Homo sapiens (Human))
Saarland University
Curated by ChEMBL
LigandPNGBDBM50295630(CHEMBL557232 | rac-4'-(1-Imidazol-1-yl-propyl)-3,5...)
Affinity DataIC50:  379nM. Assay description: Inhibition of human CYP17 expressed in Escherichia coli coexpressing NADPH-P450 reductase
In DepthDetails ArticlePubMed