BDBM50295721 3-(10-(3-(4-(1,3-dimethyl-2,6-dioxo-1,2,3,6-tetrahydropyrimidin-4-yl)-1,4-diazepan-1-yl)propyl)-10H-phenothiazin-2-yl)acrylic acid::CHEMBL562792
SMILES Cn1c(cc(=O)n(C)c1=O)N1CCCN(CCCN2c3ccccc3Sc3ccc(\C=C/C(O)=O)cc23)CC1
InChI Key InChIKey=YJYGESNCQHFTHG-BENRWUELSA-N
Data  1 IC50
  Tab Delimited (TSV)   2D SDfile   Computed 3D by Vconf -m prep SDfile
Find this compound or compounds like it in BindingDB:
Activity Spreadsheet -- Enzyme Inhibition Constant Data from BindingDB
Found 1 hit for monomerid = 50295721
TargetHistamine H1 receptor(Homo sapiens (Human))
Dainippon Sumitomo Phrama.
Curated by ChEMBL
LigandPNGBDBM50295721(3-(10-(3-(4-(1,3-dimethyl-2,6-dioxo-1,2,3,6-tetrah...)
Affinity DataIC50:  323nM. Assay description: Displacement of [3H]pyrilamine from human recombinant histamine H1 receptor expressed in CHOK1 cells by scintillation counting
In DepthDetails ArticlePubMed