BDBM50295764 1-benzyl-1H-pyrrolo[3,2-b]pyridine::CHEMBL561256
SMILES C(c1ccccc1)n1ccc2ncccc12
InChI Key InChIKey=LOGFFHFLSCMKJF-UHFFFAOYSA-N
Data  1 IC50
  Tab Delimited (TSV)   2D SDfile   Computed 3D by Vconf -m prep SDfile
Find this compound or compounds like it in BindingDB:
Activity Spreadsheet -- Enzyme Inhibition Constant Data from BindingDB
Found 1 hit for monomerid = 50295764
TargetHepatocyte growth factor receptor(Homo sapiens (Human))
Ucb Pharma
Curated by ChEMBL
LigandPNGBDBM50295764(1-benzyl-1H-pyrrolo[3,2-b]pyridine | CHEMBL561256)
Affinity DataIC50:  19nM. Assay description: Inhibition of human recombinant His-tagged c-Met by TR-FRET assay
In DepthDetails ArticlePubMed