BDBM50296132 CHEMBL561120::N-(((S)-1-((R)-3-amino-4-(3-chlorophenyl)butanoyl)pyrrolidin-2-yl)methyl)cyclopropanecarboxamide
SMILES N[C@@H](CC(=O)N1CCC[C@H]1CNC(=O)C1CC1)Cc1cccc(Cl)c1
InChI Key InChIKey=IGLNCVBGTJJFNA-SJORKVTESA-N
Data  4 IC50
  Tab Delimited (TSV)   2D SDfile   Computed 3D by Vconf -m prep SDfile
Find this compound or compounds like it in BindingDB:
Activity Spreadsheet -- Enzyme Inhibition Constant Data from BindingDB
Found 4 hits for monomerid = 50296132
TargetDipeptidyl peptidase 4(Homo sapiens (Human))
Santhera Pharmaceuticals (Switzerland)
Curated by ChEMBL
LigandPNGBDBM50296132(CHEMBL561120 | N-(((S)-1-((R)-3-amino-4-(3-chlorop...)
Affinity DataIC50:  12nM. Assay description: Inhibition of DPP4 by continuous fluorimetric assay
In DepthDetails ArticlePubMed
TargetDipeptidyl peptidase 9(Homo sapiens (Human))
Santhera Pharmaceuticals (Switzerland)
Curated by ChEMBL
LigandPNGBDBM50296132(CHEMBL561120 | N-(((S)-1-((R)-3-amino-4-(3-chlorop...)
Affinity DataIC50:  3.40E+3nM. Assay description: Inhibition of DPP9 by continuous fluorimetric assay
In DepthDetails ArticlePubMed
TargetDipeptidyl peptidase 8(Homo sapiens (Human))
Santhera Pharmaceuticals (Switzerland)
Curated by ChEMBL
LigandPNGBDBM50296132(CHEMBL561120 | N-(((S)-1-((R)-3-amino-4-(3-chlorop...)
Affinity DataIC50:  4.00E+3nM. Assay description: Inhibition of DPP8 by continuous fluorimetric assay
In DepthDetails ArticlePubMed
TargetDipeptidyl peptidase 2(Homo sapiens (Human))
Santhera Pharmaceuticals (Switzerland)
Curated by ChEMBL
LigandPNGBDBM50296132(CHEMBL561120 | N-(((S)-1-((R)-3-amino-4-(3-chlorop...)
Affinity DataIC50:  1.10E+4nM. Assay description: Inhibition of DPP7 by continuous fluorimetric assay
In DepthDetails ArticlePubMed