BDBM50296695 CHEMBL537963::N-((9-ethyl-9H-carbazol-3-yl)methylene)-3-fluoro-4-methylaniline
SMILES CCn1c2ccccc2c2cc(\C=N\c3ccc(C)c(F)c3)ccc12
InChI Key InChIKey=CWEWVLSYVACYHL-ZVHZXABRSA-N
Data  1 KI  1 IC50
  Tab Delimited (TSV)   2D SDfile   Computed 3D by Vconf -m prep SDfile
Find this compound or compounds like it in BindingDB:
Activity Spreadsheet -- Enzyme Inhibition Constant Data from BindingDB
Found 2 hits for monomerid = 50296695
TargetMetabotropic glutamate receptor 1(RAT)
Merz Pharmaceuticals
Curated by ChEMBL
LigandPNGBDBM50296695(CHEMBL537963 | N-((9-ethyl-9H-carbazol-3-yl)methyl...)
Affinity DataKi: >4.00E+4nM. Assay description: Displacement of [3H]E-3-(2-chloro-8-methylquinolin-3-yl)-1-(thiophen-2-yl)prop-2-en-1-one from mGluR1 in rat cerebellar membrane after 14 to 16 hrs b...
In DepthDetails ArticlePubMed
TargetMetabotropic glutamate receptor 1(RAT)
Merz Pharmaceuticals
Curated by ChEMBL
LigandPNGBDBM50296695(CHEMBL537963 | N-((9-ethyl-9H-carbazol-3-yl)methyl...)
Affinity DataIC50: >4.00E+4nM. Assay description: Allosteric antagonist activity at mGluR1 in Sprague-Dawley rat cerebellar granule cells assessed as accumulation of [3H]inositol phosphate by liquid ...
In DepthDetails ArticlePubMed