BDBM50297026 3,6-Diamino-1H-pyrazolo[3,4-b]piridina-5-carbonitrile::CHEMBL553398
SMILES Nc1n[nH]c2nc(N)c(cc12)C#N
InChI Key InChIKey=QQMCPWOEDXMLTH-UHFFFAOYSA-N
Data  2 IC50
  Tab Delimited (TSV)   2D SDfile   Computed 3D by Vconf -m prep SDfile
Find this compound or compounds like it in BindingDB:
Activity Spreadsheet -- Enzyme Inhibition Constant Data from BindingDB
Found 2 hits for monomerid = 50297026
TargetCyclin-dependent kinase 5(Homo sapiens (Human))
Laboratorio De Radicales Libres Y QuÍMica Computacional (Iqog, Csic)
Curated by ChEMBL
LigandPNGBDBM50297026(3,6-Diamino-1H-pyrazolo[3,4-b]piridina-5-carbonitr...)
Affinity DataIC50: >1.00E+4nM. Assay description: Inhibition of human recombinant CDK5/P25 by scintillation counting
In DepthDetails ArticlePubMed
TargetDual specificity tyrosine-phosphorylation-regulated kinase 1A(Homo sapiens (Human))
Laboratorio De Radicales Libres Y QuÍMica Computacional (Iqog, Csic)
Curated by ChEMBL
LigandPNGBDBM50297026(3,6-Diamino-1H-pyrazolo[3,4-b]piridina-5-carbonitr...)
Affinity DataIC50: >1.00E+4nM. Assay description: Inhibition of human recombinant GST-fusion DYRK1A expressed in Escherichia coli
In DepthDetails ArticlePubMed