BDBM50297032 CHEMBL549301::N-(6-Amino-5-cyano-1-methyl-4-phenyl-1H-pyrazolo[3,4-b]pyridin-3-yl)acetamide
SMILES CC(=O)Nc1nn(C)c2nc(N)c(C#N)c(-c3ccccc3)c12
InChI Key InChIKey=GGEMRXAHDNGWQR-UHFFFAOYSA-N
Data  2 IC50
  Tab Delimited (TSV)   2D SDfile   Computed 3D by Vconf -m prep SDfile
Find this compound or compounds like it in BindingDB:
Activity Spreadsheet -- Enzyme Inhibition Constant Data from BindingDB
Found 2 hits for monomerid = 50297032
TargetCyclin-dependent kinase 5(Homo sapiens (Human))
Laboratorio De Radicales Libres Y QuÍMica Computacional (Iqog, Csic)
Curated by ChEMBL
LigandPNGBDBM50297032(CHEMBL549301 | N-(6-Amino-5-cyano-1-methyl-4-pheny...)
Affinity DataIC50: >1.00E+4nM. Assay description: Inhibition of human recombinant CDK5/P25 by scintillation counting
In DepthDetails ArticlePubMed
TargetDual specificity tyrosine-phosphorylation-regulated kinase 1A(Homo sapiens (Human))
Laboratorio De Radicales Libres Y QuÍMica Computacional (Iqog, Csic)
Curated by ChEMBL
LigandPNGBDBM50297032(CHEMBL549301 | N-(6-Amino-5-cyano-1-methyl-4-pheny...)
Affinity DataIC50: >1.00E+4nM. Assay description: Inhibition of human recombinant GST-fusion DYRK1A expressed in Escherichia coli
In DepthDetails ArticlePubMed