BDBM50297789 CHEMBL560204::N-ethyl-2-(5-(4-fluorophenoxy)-2-(pyridin-2-yl)-1H-benzo[d]imidazol-6-yl)pyrrolidine-1-carboxamide
SMILES CCNC(=O)N1CCCC1c1cc2nc([nH]c2cc1Oc1ccc(F)cc1)-c1ccccn1
InChI Key InChIKey=GIMOWYWHWAUYLT-UHFFFAOYSA-N
Data  1 EC50
  Tab Delimited (TSV)   2D SDfile   Computed 3D by Vconf -m prep SDfile
Find this compound or compounds like it in BindingDB:
Activity Spreadsheet -- Enzyme Inhibition Constant Data from BindingDB
Found 1 hit for monomerid = 50297789
TargetHexokinase-4(Homo sapiens (Human))
Banyu Tsukuba Research Institute
Curated by ChEMBL
LigandPNGBDBM50297789(CHEMBL560204 | N-ethyl-2-(5-(4-fluorophenoxy)-2-(p...)
Affinity DataEC50: >3.00E+4nM. Assay description: Activation of flag-tagged recombinant human liver glucokinase expressed in Escherichia coli assessed as glucose-6-phosphate dehydrogenase by spectrop...
In DepthDetails ArticlePubMed