BDBM50299301 4-(2-hydroxy-5-methoxybenzylideneamino)benzenesulfonamide::CHEMBL566297
SMILES COc1ccc(O)c(\C=N\c2ccc(cc2)S(N)(=O)=O)c1
InChI Key InChIKey=CSDKEBNKFQSWDP-CXUHLZMHSA-N
Data  3 KI
  Tab Delimited (TSV)   2D SDfile   Computed 3D by Vconf -m prep SDfile
Find this compound or compounds like it in BindingDB:
Activity Spreadsheet -- Enzyme Inhibition Constant Data from BindingDB
Found 3 hits for monomerid = 50299301
TargetCarbonic anhydrase 2(Homo sapiens (Human))
Enscm/Umii/Umr-Cnrs 5635
Curated by ChEMBL
LigandPNGBDBM50299301(4-(2-hydroxy-5-methoxybenzylideneamino)benzenesulf...)
Affinity DataKi:  7nM. Assay description: Inhibition of human carbonic anhydrase 2-catalyzed CO2 hydration preincubated for 10 mins by stopped-flow assay
In DepthDetails ArticlePubMed
TargetCarbonic anhydrase 1(Homo sapiens (Human))
Enscm/Umii/Umr-Cnrs 5635
Curated by ChEMBL
LigandPNGBDBM50299301(4-(2-hydroxy-5-methoxybenzylideneamino)benzenesulf...)
Affinity DataKi:  52nM. Assay description: Inhibition of human carbonic anhydrase 1-catalyzed CO2 hydration preincubated for 10 mins by stopped-flow assay
In DepthDetails ArticlePubMed
TargetCarbonic anhydrase 2(Homo sapiens (Human))
Enscm/Umii/Umr-Cnrs 5635
Curated by ChEMBL
LigandPNGBDBM50299301(4-(2-hydroxy-5-methoxybenzylideneamino)benzenesulf...)
Affinity DataKi:  86.6nM. Assay description: Inhibition of human carbonic anhydrase 2-catalyzed CO2 hydration by stopped flow technique
In DepthDetails ArticlePubMed