BDBM50300668 CHEMBL576967::N-[3-(4,5-dihydro-1H-imidazol-2-ylhydrazono-2,3-dihydro-1H-inden-5-yl)-4-methyl-3,4-dihydro-2H-1,4-benzoxazine-7-sulfonamide
SMILES [#6]-[#7]-1-[#6]-[#6]-[#8]-c2ccc(cc-12)S(=O)(=O)[#7]-c1ccc2-[#6]-[#6]-[#6](=[#7]\[#7]=[#6]-3\[#7]-[#6]-[#6]-[#7]-3)-c2c1
InChI Key InChIKey=LPULTYDZZMPHIN-UHFFFAOYSA-N
Data  1 KI
  Tab Delimited (TSV)   2D SDfile   Computed 3D by Vconf -m prep SDfile
Find this compound or compounds like it in BindingDB:
Activity Spreadsheet -- Enzyme Inhibition Constant Data from BindingDB
Found 1 hit for monomerid = 50300668
Target5-hydroxytryptamine receptor 6(Homo sapiens (Human))
Universitat De Barcelona
Curated by ChEMBL
LigandPNGBDBM50300668(CHEMBL576967 | N-[3-(4,5-dihydro-1H-imidazol-2-ylh...)
Affinity DataKi:  70nM. Assay description: Displacement of [3H]LSD from human recombinant 5HT6 receptor expressed in HEK293 cells after 60 mins by liquid scintillation counting
In DepthDetails ArticlePubMed