BDBM50301087 4-(4-fluorobenzyloxy)-1-(4-(pyrrolidin-1-yl)phenethyl)pyridin-2(1H)-one::CHEMBL568345
SMILES Fc1ccc(COc2ccn(CCc3ccc(cc3)N3CCCC3)c(=O)c2)cc1
InChI Key InChIKey=ZXCQUKGPWVJEJZ-UHFFFAOYSA-N
Data  1 IC50
  Tab Delimited (TSV)   2D SDfile   Computed 3D by Vconf -m prep SDfile
Find this compound or compounds like it in BindingDB:
Activity Spreadsheet -- Enzyme Inhibition Constant Data from BindingDB
Found 1 hit for monomerid = 50301087
TargetMelanin-concentrating hormone receptor 1(Homo sapiens (Human))
Tsukuba Research Institute
Curated by ChEMBL
LigandPNGBDBM50301087(4-(4-fluorobenzyloxy)-1-(4-(pyrrolidin-1-yl)phenet...)
Affinity DataIC50: >1.00E+3nM. Assay description: Antagonistic activity against MCH1R expressed on CHOK1 cells assessed as intracellular calcium mobilization by FLIPR
In DepthDetails ArticlePubMed