BDBM50301201 6-((4,5-dimethyloxazol-2-ylthio)methyl)-N-((6-(2-fluoroethoxy)pyridin-2-yl)methyl)-4-morpholinopyridin-2-amine::CHEMBL568152
SMILES Cc1nc(SCc2cc(cc(NCc3cccc(OCCF)n3)n2)N2CCOCC2)oc1C
InChI Key InChIKey=SERFARPYHPYNFP-UHFFFAOYSA-N
Data  1 IC50
  Tab Delimited (TSV)   2D SDfile   Computed 3D by Vconf -m prep SDfile
Find this compound or compounds like it in BindingDB:
Activity Spreadsheet -- Enzyme Inhibition Constant Data from BindingDB
Found 1 hit for monomerid = 50301201
TargetNeuropeptide Y receptor type 1(Homo sapiens (Human))
Tsukuba Research Institute
Curated by ChEMBL
LigandPNGBDBM50301201(6-((4,5-dimethyloxazol-2-ylthio)methyl)-N-((6-(2-f...)
Affinity DataIC50:  19nM. Assay description: Displacement of [125I]-PYY from human NPYY1 receptor overexpressed in CHO cell membrane after 120 mins by scintillation counting
In DepthDetails ArticlePubMed