BDBM50301326 5-chloro-6-(4-(1-(4-cyanobenzyl)piperidin-4-yl)piperazin-1-yl)-N-(4-fluorobenzyl)nicotinamide::CHEMBL565980
SMILES Fc1ccc(CNC(=O)c2cnc(N3CCN(CC3)C3CCN(Cc4ccc(cc4)C#N)CC3)c(Cl)c2)cc1
InChI Key InChIKey=FEYBOBAELIEEPL-UHFFFAOYSA-N
Data  1 KI
  Tab Delimited (TSV)   2D SDfile   Computed 3D by Vconf -m prep SDfile
Find this compound or compounds like it in BindingDB:
Activity Spreadsheet -- Enzyme Inhibition Constant Data from BindingDB
Found 1 hit for monomerid = 50301326
TargetC-X-C chemokine receptor type 3(Homo sapiens (Human))
Ligand Pharmaceuticals
Curated by ChEMBL
LigandPNGBDBM50301326(5-chloro-6-(4-(1-(4-cyanobenzyl)piperidin-4-yl)pip...)
Affinity DataKi:  90nM. Assay description: Displacement of 125I-IP10 from recombinant human CXCR3 receptor expressed in Ba/F3 cell membrane after 1 to 4 hrs by scintillation counting
In DepthDetails ArticlePubMed