BDBM50301344 5-chloro-6-(4-(1-(4-methoxybenzyl)piperidin-4-yl)piperazin-1-yl)-N-(2-phenoxyethyl)nicotinamide::CHEMBL565970
SMILES COc1ccc(CN2CCC(CC2)N2CCN(CC2)c2ncc(cc2Cl)C(=O)NCCOc2ccccc2)cc1
InChI Key InChIKey=JSGXRSHSVKALPE-UHFFFAOYSA-N
Data  1 KI
  Tab Delimited (TSV)   2D SDfile   Computed 3D by Vconf -m prep SDfile
Find this compound or compounds like it in BindingDB:
Activity Spreadsheet -- Enzyme Inhibition Constant Data from BindingDB
Found 1 hit for monomerid = 50301344
TargetC-X-C chemokine receptor type 3(Homo sapiens (Human))
Ligand Pharmaceuticals
Curated by ChEMBL
LigandPNGBDBM50301344(5-chloro-6-(4-(1-(4-methoxybenzyl)piperidin-4-yl)p...)
Affinity DataKi:  120nM. Assay description: Displacement of 125I-IP10 from recombinant human CXCR3 receptor expressed in Ba/F3 cell membrane after 1 to 4 hrs by scintillation counting
In DepthDetails ArticlePubMed