BDBM50303336 Diphosphoric Acid 1-beta-Cyclohexyl Ester 2-(Uridine-5'-yl)ester,di ammonium Salt
SMILES O[C@H]1[C@@H](O)[C@@H](O[C@@H]1COP([O-])(=O)OP([O-])(=O)OC1CCCCC1)n1ccc(=O)[nH]c1=O
InChI Key InChIKey=ZKANYWGCBDYGBM-FMKGYKFTSA-L
Data  2 EC50
  Tab Delimited (TSV)   2D SDfile   Computed 3D by Vconf -m prep SDfile
Find this compound or compounds like it in BindingDB:
Activity Spreadsheet -- Enzyme Inhibition Constant Data from BindingDB
Found 2 hits for monomerid = 50303336
TargetP2Y purinoceptor 6(Homo sapiens (Human))
National Institute Of Diabetes And Digestive And Kidney Diseases
Curated by ChEMBL
LigandPNGBDBM50303336(Diphosphoric Acid 1-beta-Cyclohexyl Ester 2-(Uridi...)
Affinity DataEC50: >1.00E+4nM. Assay description: Agonist activity at human P2Y6 receptor expressed in human 1321N1 cells coexpressing phospholipase C-activating Gq protein assessed as [3H]inositol p...
In DepthDetails ArticlePubMed
TargetP2Y purinoceptor 14(Homo sapiens (Human))
National Institute Of Diabetes And Digestive And Kidney Diseases
Curated by ChEMBL
LigandPNGBDBM50303336(Diphosphoric Acid 1-beta-Cyclohexyl Ester 2-(Uridi...)
Affinity DataEC50:  5.16E+3nM. Assay description: Agonist activity at human P2Y14 receptor expressed in HEK293 cells coexpressing phospholipase C-activating Gi protein cells assessed as inhibition of...
In DepthDetails ArticlePubMed