BDBM50303794 (-)-(S)-N6-Propyl-N6-(2-(4-(quinolin-5-yl)piperazin-1-yl)ethyl)-4,5,6,7-tetrahydrobenzo[d]thiazole-2,6-diamine::CHEMBL569107
SMILES CCCN(CCN1CCN(CC1)c1cccc2ncccc12)[C@H]1CCc2nc(N)sc2C1
InChI Key InChIKey=JULCETCXZSSJNN-IBGZPJMESA-N
Data  2 KI  2 EC50
  Tab Delimited (TSV)   2D SDfile   Computed 3D by Vconf -m prep SDfile
Find this compound or compounds like it in BindingDB:
Activity Spreadsheet -- Enzyme Inhibition Constant Data from BindingDB
Found 4 hits for monomerid = 50303794
TargetD(3) dopamine receptor(Homo sapiens (Human))
Wayne State University
Curated by ChEMBL
LigandPNGBDBM50303794((-)-(S)-N6-Propyl-N6-(2-(4-(quinolin-5-yl)piperazi...)
Affinity DataKi:  1.21nM. Assay description: Displacement of [3H]spiperone from human dopamine D3 receptor expressed in HEK293 cells
In DepthDetails ArticlePubMed
TargetD(2) dopamine receptor(Homo sapiens (Human))
Wayne State University
Curated by ChEMBL
LigandPNGBDBM50303794((-)-(S)-N6-Propyl-N6-(2-(4-(quinolin-5-yl)piperazi...)
Affinity DataKi:  57.7nM. Assay description: Displacement of [3H]spiperone from human dopamine D2L receptor expressed in HEK293 cells
In DepthDetails ArticlePubMed
TargetD(2) dopamine receptor(Homo sapiens (Human))
Wayne State University
Curated by ChEMBL
LigandPNGBDBM50303794((-)-(S)-N6-Propyl-N6-(2-(4-(quinolin-5-yl)piperazi...)
Affinity DataEC50:  13.5nM. Assay description: Agonist activity at human dopamine D2L receptor expressed in CHO cells assessed as stimulation of [35S]GTPgamma binding
In DepthDetails ArticlePubMed
TargetD(3) dopamine receptor(Homo sapiens (Human))
Wayne State University
Curated by ChEMBL
LigandPNGBDBM50303794((-)-(S)-N6-Propyl-N6-(2-(4-(quinolin-5-yl)piperazi...)
Affinity DataEC50:  0.528nM. Assay description: Agonist activity at human dopamine D3 receptor expressed in mouse AtT-20 cells assessed as stimulation of [35S]GTPgamma binding
In DepthDetails ArticlePubMed