BDBM50304399 10-Methoxy-6-methyl-5,6,7,8,13,14-hexahydrodibenzo[c,g]azecine::CHEMBL593394
SMILES COc1ccc2CCc3ccccc3CN(C)CCc2c1
InChI Key InChIKey=SXNYQFGWYSVRLE-UHFFFAOYSA-N
Data  5 KI
  Tab Delimited (TSV)   2D SDfile   Computed 3D by Vconf -m prep SDfile
Find this compound or compounds like it in BindingDB:
Activity Spreadsheet -- Enzyme Inhibition Constant Data from BindingDB
Found 5 hits for monomerid = 50304399
TargetD(1B) dopamine receptor(Homo sapiens (Human))
Friedrich-Schiller-Universit£T Jena
Curated by ChEMBL
LigandPNGBDBM50304399(10-Methoxy-6-methyl-5,6,7,8,13,14-hexahydrodibenzo...)
Affinity DataKi:  1.51E+3nM. Assay description: Displacement of [3H]SCH23390 from human dopamine D5 receptor expressed in CHO cells by scintillation counting
In DepthDetails ArticlePubMed
TargetD(1A) dopamine receptor(Homo sapiens (Human))
Friedrich-Schiller-Universit£T Jena
Curated by ChEMBL
LigandPNGBDBM50304399(10-Methoxy-6-methyl-5,6,7,8,13,14-hexahydrodibenzo...)
Affinity DataKi:  1.73E+3nM. Assay description: Displacement of [3H]SCH23390 from human dopamine D1 receptor expressed in CHO cells by scintillation counting
In DepthDetails ArticlePubMed
TargetD(4) dopamine receptor(Homo sapiens (Human))
Friedrich-Schiller-Universit£T Jena
Curated by ChEMBL
LigandPNGBDBM50304399(10-Methoxy-6-methyl-5,6,7,8,13,14-hexahydrodibenzo...)
Affinity DataKi: >1.00E+4nM. Assay description: Displacement of [3H]spiperone from human dopamine D4 receptor expressed in CHO cells by scintillation counting
In DepthDetails ArticlePubMed
TargetD(2) dopamine receptor(Homo sapiens (Human))
Friedrich-Schiller-Universit£T Jena
Curated by ChEMBL
LigandPNGBDBM50304399(10-Methoxy-6-methyl-5,6,7,8,13,14-hexahydrodibenzo...)
Affinity DataKi: >1.00E+4nM. Assay description: Displacement of [3H]spiperone from human dopamine D2L receptor expressed in CHO cells by scintillation counting
In DepthDetails ArticlePubMed
TargetD(3) dopamine receptor(Homo sapiens (Human))
Friedrich-Schiller-Universit£T Jena
Curated by ChEMBL
LigandPNGBDBM50304399(10-Methoxy-6-methyl-5,6,7,8,13,14-hexahydrodibenzo...)
Affinity DataKi: >1.00E+4nM. Assay description: Displacement of [3H]spiperone from human dopamine D3 receptor expressed in CHO cells by scintillation counting
In DepthDetails ArticlePubMed