BDBM50304406 3-(2-Ethyl-4-methoxyphenyl)-2-methyl-1,2,3,4-tetrahydro-isoquinoline::CHEMBL594799
SMILES CCc1cc(OC)ccc1C1Cc2ccccc2CN1C
InChI Key InChIKey=KTAAQEHLGMUIRW-UHFFFAOYSA-N
Data  5 KI
  Tab Delimited (TSV)   2D SDfile   Computed 3D by Vconf -m prep SDfile
Find this compound or compounds like it in BindingDB:
Activity Spreadsheet -- Enzyme Inhibition Constant Data from BindingDB
Found 5 hits for monomerid = 50304406
TargetD(1A) dopamine receptor(Homo sapiens (Human))
Friedrich-Schiller-Universit£T Jena
Curated by ChEMBL
LigandPNGBDBM50304406(3-(2-Ethyl-4-methoxyphenyl)-2-methyl-1,2,3,4-tetra...)
Affinity DataKi: >1.00E+4nM. Assay description: Displacement of [3H]SCH23390 from human dopamine D1 receptor expressed in CHO cells by scintillation counting
In DepthDetails ArticlePubMed
TargetD(2) dopamine receptor(Homo sapiens (Human))
Friedrich-Schiller-Universit£T Jena
Curated by ChEMBL
LigandPNGBDBM50304406(3-(2-Ethyl-4-methoxyphenyl)-2-methyl-1,2,3,4-tetra...)
Affinity DataKi: >1.00E+4nM. Assay description: Displacement of [3H]spiperone from human dopamine D2L receptor expressed in CHO cells by scintillation counting
In DepthDetails ArticlePubMed
TargetD(1B) dopamine receptor(Homo sapiens (Human))
Friedrich-Schiller-Universit£T Jena
Curated by ChEMBL
LigandPNGBDBM50304406(3-(2-Ethyl-4-methoxyphenyl)-2-methyl-1,2,3,4-tetra...)
Affinity DataKi: >1.00E+4nM. Assay description: Displacement of [3H]SCH23390 from human dopamine D5 receptor expressed in CHO cells by scintillation counting
In DepthDetails ArticlePubMed
TargetD(4) dopamine receptor(Homo sapiens (Human))
Friedrich-Schiller-Universit£T Jena
Curated by ChEMBL
LigandPNGBDBM50304406(3-(2-Ethyl-4-methoxyphenyl)-2-methyl-1,2,3,4-tetra...)
Affinity DataKi: >1.00E+4nM. Assay description: Displacement of [3H]spiperone from human dopamine D4 receptor expressed in CHO cells by scintillation counting
In DepthDetails ArticlePubMed
TargetD(3) dopamine receptor(Homo sapiens (Human))
Friedrich-Schiller-Universit£T Jena
Curated by ChEMBL
LigandPNGBDBM50304406(3-(2-Ethyl-4-methoxyphenyl)-2-methyl-1,2,3,4-tetra...)
Affinity DataKi: >1.00E+4nM. Assay description: Displacement of [3H]spiperone from human dopamine D3 receptor expressed in CHO cells by scintillation counting
In DepthDetails ArticlePubMed