BDBM50305001 CHEMBL592288::N4-(3-(1H-pyrrol-2-yl)-1H-indazol-5-yl)pyrimidine-2,4-diamine
SMILES Nc1nccc(Nc2ccc3[nH]nc(-c4ccc[nH]4)c3c2)n1
InChI Key InChIKey=GUCGAGSVDISAAV-UHFFFAOYSA-N
Data  1 IC50
  Tab Delimited (TSV)   2D SDfile   Computed 3D by Vconf -m prep SDfile
Find this compound or compounds like it in BindingDB:
Activity Spreadsheet -- Enzyme Inhibition Constant Data from BindingDB
Found 1 hit for monomerid = 50305001
TargetMAP kinase-activated protein kinase 2(Homo sapiens (Human))
Abbott Laboratories
Curated by ChEMBL
LigandPNGBDBM50305001(CHEMBL592288 | N4-(3-(1H-pyrrol-2-yl)-1H-indazol-5...)
Affinity DataIC50:  160nM. Assay description: Inhibition of MK2
In DepthDetails ArticlePubMed