BDBM50305422 1-(2-chlorophenyl)-5-(4-chlorophenyl)-4-(cyanomethyl)-N-cycloheptyl-1H-pyrazole-3-carboxamide::CHEMBL589884
SMILES Clc1ccc(cc1)-c1c(CC#N)c(nn1-c1ccccc1Cl)C(=O)NC1CCCCCC1
InChI Key InChIKey=SPPMUIFLVYBDMD-UHFFFAOYSA-N
Data  1 IC50
  Tab Delimited (TSV)   2D SDfile   Computed 3D by Vconf -m prep SDfile
Find this compound or compounds like it in BindingDB:
Activity Spreadsheet -- Enzyme Inhibition Constant Data from BindingDB
Found 1 hit for monomerid = 50305422
TargetCannabinoid receptor 1(Homo sapiens (Human))
7Tm Pharma
Curated by ChEMBL
LigandPNGBDBM50305422(1-(2-chlorophenyl)-5-(4-chlorophenyl)-4-(cyanometh...)
Affinity DataIC50:  0.490nM. Assay description: Antagonist activity at human recombinant CB1 receptor expressed in CHO-K1 cells assessed as inhibition of CP55940-stimulated GTPgammaS binding
In DepthDetails ArticlePubMed