BDBM50306228 4-(2-amino-2-iminoethyl)-1-(2-chlorophenyl)-5-(4-chlorophenyl)-N-(4-fluorophenyl)-1H-pyrazole-3-carboxamide::CHEMBL605313
SMILES NC(=N)Cc1c(nn(c1-c1ccc(Cl)cc1)-c1ccccc1Cl)C(=O)Nc1ccc(F)cc1
InChI Key InChIKey=QWOVGBHZFLBBHN-UHFFFAOYSA-N
Data  1 IC50
  Tab Delimited (TSV)   2D SDfile   Computed 3D by Vconf -m prep SDfile
Find this compound or compounds like it in BindingDB:
Activity Spreadsheet -- Enzyme Inhibition Constant Data from BindingDB
Found 1 hit for monomerid = 50306228
TargetCannabinoid receptor 1(Homo sapiens (Human))
7Tm Pharma
Curated by ChEMBL
LigandPNGBDBM50306228(4-(2-amino-2-iminoethyl)-1-(2-chlorophenyl)-5-(4-c...)
Affinity DataIC50:  1.5nM. Assay description: Antagonist activity at human CB1 receptor expressed in CHO-K1 cells assessed as inhibition of CP55940-induced GTPgammaS binding
In DepthDetails ArticlePubMed