BDBM50306565 2-(4-ethylphenoxy)-N-(2-hydroxy-5-(4,4,5,5-tetramethyl-1,3,2-dioxaborolan-2-yl)phenyl)acetamide::CHEMBL603712
SMILES CCc1ccc(OCC(=O)Nc2cc(ccc2O)B2OC(C)(C)C(C)(C)O2)cc1
InChI Key InChIKey=NZDHWXCIDIKWKY-UHFFFAOYSA-N
Data  1 IC50
  Tab Delimited (TSV)   2D SDfile   Computed 3D by Vconf -m prep SDfile
Find this compound or compounds like it in BindingDB:
Activity Spreadsheet -- Enzyme Inhibition Constant Data from BindingDB
Found 1 hit for monomerid = 50306565
TargetHypoxia-inducible factor 1-alpha(Homo sapiens (Human))
Gakushuin University
Curated by ChEMBL
LigandPNGBDBM50306565(2-(4-ethylphenoxy)-N-(2-hydroxy-5-(4,4,5,5-tetrame...)
Affinity DataIC50:  9.18E+4nM. Assay description: Inhibition of hypoxia-induced HIF1alpha activation in human HeLa cells after 12 hrs by HRE-luciferase reporter gene assay
In DepthDetails ArticlePubMed