BDBM50307258 CHEMBL578317::[N-Ac,des-Sar]Gal-B2
SMILES CCCCCCCCCCCCCCCC(=O)NCCCC[C@H](NC(=O)[C@H](CCCCN)NC(=O)[C@H](CCCCN)NC(=O)[C@@H]1CCCN1C(=O)CNC(=O)[C@H](CC(C)C)NC(=O)[C@H](CC(C)C)NC(=O)[C@H](Cc1ccc(O)cc1)NC(=O)CNC(=O)[C@H](C)NC(=O)[C@H](CO)NC(=O)[C@H](CC(N)=O)NC(=O)[C@H](CC(C)C)NC(=O)[C@@H](NC(=O)[C@H](Cc1c[nH]c2ccccc12)NC(C)=O)[C@@H](C)O)C(=O)N[C@@H](CCCCN)C(N)=O
InChI Key InChIKey=ODFVMHJVAFRRKO-QWBMYOKVSA-N
Data  2 KI
  Tab Delimited (TSV)   2D SDfile   Computed 3D by Vconf -m prep SDfile
Find this compound or compounds like it in BindingDB:
Activity Spreadsheet -- Enzyme Inhibition Constant Data from BindingDB
Found 2 hits for monomerid = 50307258
TargetGalanin receptor type 1(Homo sapiens (Human))
University Of Utah
Curated by ChEMBL
LigandPNGBDBM50307258(CHEMBL578317 | [N-Ac,des-Sar]Gal-B2)
Affinity DataKi:  1.70nM. Assay description: Displacement of Eu-labeled galanin from human GalR1 by DELFIA competitive assay
In DepthDetails ArticlePubMed
TargetGalanin receptor type 2(Homo sapiens (Human))
University Of Utah
Curated by ChEMBL
LigandPNGBDBM50307258(CHEMBL578317 | [N-Ac,des-Sar]Gal-B2)
Affinity DataKi:  16nM. Assay description: Displacement of Eu-labeled galanin from human GalR2 by DELFIA competitive assay
In DepthDetails ArticlePubMed