BDBM50308542 2-Chloro-7-methoxy-8-pentyloxy-1-quinoline-3-carboxylic acid(2-phenylethyl)amide::CHEMBL592684
SMILES CCCCCOc1c(OC)ccc2cc(C(=O)NCCc3ccccc3)c(Cl)nc12
InChI Key InChIKey=ZUENDXIRQKLKPB-UHFFFAOYSA-N
Data  2 KI
  Tab Delimited (TSV)   2D SDfile   Computed 3D by Vconf -m prep SDfile
Find this compound or compounds like it in BindingDB:
Activity Spreadsheet -- Enzyme Inhibition Constant Data from BindingDB
Found 2 hits for monomerid = 50308542
TargetCannabinoid receptor 2(Homo sapiens (Human))
Indiana University School Of Medicine
Curated by ChEMBL
LigandPNGBDBM50308542(2-Chloro-7-methoxy-8-pentyloxy-1-quinoline-3-carbo...)
Affinity DataKi:  497nM. Assay description: Displacement of [3H]CP55940 from CB2 receptor
In DepthDetails ArticlePubMed
TargetCannabinoid receptor 1(Homo sapiens (Human))
Indiana University School Of Medicine
Curated by ChEMBL
LigandPNGBDBM50308542(2-Chloro-7-methoxy-8-pentyloxy-1-quinoline-3-carbo...)
Affinity DataKi: >1.00E+4nM. Assay description: Displacement of [3H]CP55940 from CB1 receptor
In DepthDetails ArticlePubMed