BDBM50309010 (R)-N-(1-(5-(5-chloro-2-(2,2-difluoroethoxy)-3-fluorophenyl)-3-fluoropyridin-2-yl)ethyl)-1-ethyl-2-(2,2,2-trifluoroacetyl)hydrazinecarboxamide::CHEMBL599780
SMILES CCN(NC(=O)C(F)(F)F)C(=O)N[C@H](C)c1ncc(cc1F)-c1cc(Cl)cc(F)c1OCC(F)F
InChI Key InChIKey=NRUMXOPTHWVHMM-SECBINFHSA-N
Data  1 IC50
  Tab Delimited (TSV)   2D SDfile   Computed 3D by Vconf -m prep SDfile
Find this compound or compounds like it in BindingDB:
Activity Spreadsheet -- Enzyme Inhibition Constant Data from BindingDB
Found 1 hit for monomerid = 50309010
TargetB1 bradykinin receptor(Homo sapiens (Human))
Jerini
Curated by ChEMBL
LigandPNGBDBM50309010((R)-N-(1-(5-(5-chloro-2-(2,2-difluoroethoxy)-3-flu...)
Affinity DataIC50:  1.80nM. Assay description: Antagonist activity at bradikinin B1 receptor in human IMR90 cells assessed as inhibition of des-Arg-bradykinin-mediated calcium mobilization
In DepthDetails ArticlePubMed