BDBM50309692 CHEMBL599357::propan-2-one O-4-(dodecyloxy)phenylcarbamoyl oxime
SMILES [#6]-[#6]-[#6]-[#6]-[#6]-[#6]-[#6]-[#6]-[#6]-[#6]-[#6]-[#6]-[#8]-c1ccc(-[#7]-[#6](=O)-[#8]\[#7]=[#6](\[#6])-[#6])cc1
InChI Key InChIKey=LACDBVIAHDBHQZ-UHFFFAOYSA-N
Data  1 IC50
  Tab Delimited (TSV)   2D SDfile   Computed 3D by Vconf -m prep SDfile
Find this compound or compounds like it in BindingDB:
Activity Spreadsheet -- Enzyme Inhibition Constant Data from BindingDB
Found 1 hit for monomerid = 50309692
TargetFatty-acid amide hydrolase 1(Homo sapiens (Human))
Bristol-Myers Squibb Research & Development
Curated by ChEMBL
LigandPNGBDBM50309692(CHEMBL599357 | propan-2-one O-4-(dodecyloxy)phenyl...)
Affinity DataIC50:  5nM. Assay description: Inhibition of human FAAH expressed in human H4 cells
In DepthDetails ArticlePubMed