BDBM50309700 CHEMBL597229::benzaldehyde O-4-(octyloxy)phenylcarbamoyl oxime
SMILES CCCCCCCCOc1ccc(NC(=O)O\N=C\c2ccccc2)cc1
InChI Key InChIKey=BALHAPBNIAUXLM-PTGBLXJZSA-N
Data  1 IC50
  Tab Delimited (TSV)   2D SDfile   Computed 3D by Vconf -m prep SDfile
Find this compound or compounds like it in BindingDB:
Activity Spreadsheet -- Enzyme Inhibition Constant Data from BindingDB
Found 1 hit for monomerid = 50309700
TargetFatty-acid amide hydrolase 1(Homo sapiens (Human))
Bristol-Myers Squibb Research & Development
Curated by ChEMBL
LigandPNGBDBM50309700(CHEMBL597229 | benzaldehyde O-4-(octyloxy)phenylca...)
Affinity DataIC50:  0.430nM. Assay description: Inhibition of human FAAH expressed in human H4 cells
In DepthDetails ArticlePubMed