BDBM50309734 CHEMBL598572::phenyl 4-(octyloxy)phenylcarbamate
SMILES CCCCCCCCOc1ccc(NC(=O)Oc2ccccc2)cc1
InChI Key InChIKey=IJCMIOMSKCNMQY-UHFFFAOYSA-N
Data  1 IC50
  Tab Delimited (TSV)   2D SDfile   Computed 3D by Vconf -m prep SDfile
Find this compound or compounds like it in BindingDB:
Activity Spreadsheet -- Enzyme Inhibition Constant Data from BindingDB
Found 1 hit for monomerid = 50309734
TargetFatty-acid amide hydrolase 1(Homo sapiens (Human))
Bristol-Myers Squibb Research & Development
Curated by ChEMBL
LigandPNGBDBM50309734(CHEMBL598572 | phenyl 4-(octyloxy)phenylcarbamate)
Affinity DataIC50:  5.40nM. Assay description: Inhibition of human FAAH expressed in human H4 cells
In DepthDetails ArticlePubMed