BDBM50310964 2-((3-bromo-4-(2,4-difluorobenzyloxy)-6-methyl-2-oxopyridin-1(2H)-yl)methyl)benzamide::CHEMBL1077406
SMILES Cc1cc(OCc2ccc(F)cc2F)c(Br)c(=O)n1Cc1ccccc1C(N)=O
InChI Key InChIKey=RGZWOMIPFLICAI-UHFFFAOYSA-N
Data  2 IC50
  Tab Delimited (TSV)   2D SDfile   Computed 3D by Vconf -m prep SDfile
Find this compound or compounds like it in BindingDB:
Activity Spreadsheet -- Enzyme Inhibition Constant Data from BindingDB
Found 2 hits for monomerid = 50310964
TargetMitogen-activated protein kinase 9(Homo sapiens (Human))
Pfizer
Curated by ChEMBL
LigandPNGBDBM50310964(2-((3-bromo-4-(2,4-difluorobenzyloxy)-6-methyl-2-o...)
Affinity DataIC50: >2.00E+5nM. Assay description: Inhibition of JNK2
In DepthDetails ArticlePubMed
TargetMitogen-activated protein kinase 14(Homo sapiens (Human))
Pfizer
Curated by ChEMBL
LigandPNGBDBM50310964(2-((3-bromo-4-(2,4-difluorobenzyloxy)-6-methyl-2-o...)
Affinity DataIC50:  2.67E+3nM. Assay description: Inhibition of p38alpha
In DepthDetails ArticlePubMed