BDBM50310965 3-((3-bromo-4-(2,4-difluorobenzyloxy)-6-methyl-2-oxopyridin-1(2H)-yl)methyl)benzamide::CHEMBL1077414
SMILES Cc1cc(OCc2ccc(F)cc2F)c(Br)c(=O)n1Cc1cccc(c1)C(N)=O
InChI Key InChIKey=LWSGIZCOBNMXTH-UHFFFAOYSA-N
Data  2 IC50
  Tab Delimited (TSV)   2D SDfile   Computed 3D by Vconf -m prep SDfile
Find this compound or compounds like it in BindingDB:
Activity Spreadsheet -- Enzyme Inhibition Constant Data from BindingDB
Found 2 hits for monomerid = 50310965
TargetMitogen-activated protein kinase 9(Homo sapiens (Human))
Pfizer
Curated by ChEMBL
LigandPNGBDBM50310965(3-((3-bromo-4-(2,4-difluorobenzyloxy)-6-methyl-2-o...)
Affinity DataIC50:  1.67E+5nM. Assay description: Inhibition of JNK2
In DepthDetails ArticlePubMed
TargetMitogen-activated protein kinase 14(Homo sapiens (Human))
Pfizer
Curated by ChEMBL
LigandPNGBDBM50310965(3-((3-bromo-4-(2,4-difluorobenzyloxy)-6-methyl-2-o...)
Affinity DataIC50:  270nM. Assay description: Inhibition of p38alpha
In DepthDetails ArticlePubMed